Reaction Details
TargetPlatelet-activating factor receptor
LigandBDBM50286035
Substrate/Competitorn/a
Meas. Tech.ChEBML_155151
Ki 10±n/a nM
Citation Sheppard, GSDavidsen, SKCarrera, GMPireh, DHolms, JHHeyman, HRSteinman, DHCurtin, MLConway, RGRhein, DAAlbert, DHTapang, PMagoc, TJSummers, JB Synthesis and evaluation of water soluble indole pyrrolothiazole paf antagonists Bioorg Med Chem Lett5:2913-2918 (1995)    Article
 
Platelet-activating factor receptor
Name:Platelet-activating factor receptor
Type:Protein
Mol. Mass.:39005.63
Organism:Cavia porcellus
Description:n/a
Residue:342
BDBM50286035
NameBDBM50286035
Synonyms:6-Pyridin-3-yl-3-((R)-3-pyridin-3-yl-1H-pyrrolo[1,2-c]thiazole-7-carbonyl)-indole-1-carboxylic acid dimethylamide | CHEMBL433015
TypeSmall organic molecule
Emp. Form.C28H23N5O2S
Mol. Mass.493.58
SMILESCN(C)C(=O)n1cc(C(=O)c2ccn3[C@H](SCc23)c2cccnc2)c2ccc(cc12)-c1cccnc1