Reaction Details
TargetPlatelet-activating factor receptor
LigandBDBM50286034
Substrate/Competitorn/a
Meas. Tech.ChEBML_155151
Ki 250±n/a nM
Citation Sheppard, GSDavidsen, SKCarrera, GMPireh, DHolms, JHHeyman, HRSteinman, DHCurtin, MLConway, RGRhein, DAAlbert, DHTapang, PMagoc, TJSummers, JB Synthesis and evaluation of water soluble indole pyrrolothiazole paf antagonists Bioorg Med Chem Lett5:2913-2918 (1995)    Article
 
Platelet-activating factor receptor
Name:Platelet-activating factor receptor
Type:Protein
Mol. Mass.:39005.63
Organism:Cavia porcellus
Description:n/a
Residue:342
BDBM50286034
NameBDBM50286034
Synonyms:CHEMBL431037 | Phosphoric acid mono-{4-[1-dimethylcarbamoyl-3-((R)-3-pyridin-3-yl-1H-pyrrolo[1,2-c]thiazole-7-carbonyl)-1H-indol-6-yl]-phenyl} ester
TypeSmall organic molecule
Emp. Form.C29H25N4O6PS
Mol. Mass.588.571
SMILESCN(C)C(=O)n1cc(C(=O)c2ccn3[C@H](SCc23)c2cccnc2)c2ccc(cc12)-c1ccc(OP(O)(O)=O)cc1