Reaction Details
TargetPlatelet-activating factor receptor
LigandBDBM50286032
Substrate/Competitorn/a
Meas. Tech.ChEBML_155151
Ki 3.3±n/a nM
Citation Sheppard, GSDavidsen, SKCarrera, GMPireh, DHolms, JHHeyman, HRSteinman, DHCurtin, MLConway, RGRhein, DAAlbert, DHTapang, PMagoc, TJSummers, JB Synthesis and evaluation of water soluble indole pyrrolothiazole paf antagonists Bioorg Med Chem Lett5:2913-2918 (1995)    Article
 
Platelet-activating factor receptor
Name:Platelet-activating factor receptor
Type:Protein
Mol. Mass.:39005.63
Organism:Cavia porcellus
Description:n/a
Residue:342
BDBM50286032
NameBDBM50286032
Synonyms:2-[6-(4-Fluoro-phenyl)-3-((R)-3-pyridin-3-yl-1H-pyrrolo[1,2-c]thiazole-7-carbonyl)-indol-1-yl]-ethanesulfonic acid amide | CHEMBL317735
TypeSmall organic molecule
Emp. Form.C28H23FN4O3S2
Mol. Mass.546.636
SMILESNS(=O)(=O)CCn1cc(C(=O)c2ccn3[C@H](SCc23)c2cccnc2)c2ccc(cc12)-c1ccc(F)cc1