Reaction Details
TargetKappa-type opioid receptor
LigandBDBM50286106
Substrate/Competitorn/a
Meas. Tech.ChEMBL_145922 (CHEMBL752590)
IC50 0.260000±n/a nM
Citation Husbands, SMLewis, JW Morphinan cyclic imines and pyrrolidines containing a constrained phenyl group: High affinity opioid agonists Bioorg Med Chem Lett5:2969-2974 (1995)    Article
 
Kappa-type opioid receptor
Name:Kappa-type opioid receptor
Type:G Protein-Coupled Receptor (GPCR)
Mol. Mass.:42744.99
Organism:Cavia porcellus (domestic guinea pig)
Description:P41144
Residue:380
BDBM50286106
NameBDBM50286106
Synonyms:CHEMBL321570 | Morphinan Cyclic Imine analogue
TypeSmall organic molecule
Emp. Form.C28H32N2O2
Mol. Mass.428.5659
SMILESCOC12C=CC34C[C@@]1(C)[C@@H](N[C@H]2C31CCN(C)C4Cc2ccc(O)cc12)c1ccccc1