Reaction Details
TargetSterol O-acyltransferase 1
LigandBDBM50051456
Substrate/Competitorn/a
Meas. Tech.ChEBML_28484
IC50 10±n/a nM
Citation O'Brien, PMSliskovic, DRBernabei, AHurley, TAnderson, MKBousley, RFKrause, BKStanfield, RL Inhibitors of acyl-CoA: Cholesterol O-acyl transferase (ACAT) as hypocholesterolemic agents. 13. Design, synthesis and biological evaluation of tetrazole anilides as potent inhibitors of ACAT in vitro and hypocholesterolemic agents in vivo Bioorg Med Chem Lett5:295-300 (1995)  
 
Sterol O-acyltransferase 1
Name:Sterol O-acyltransferase 1
Type:PROTEIN
Mol. Mass.:64165.56
Organism:Rattus norvegicus
Description:ChEMBL_28796
Residue:545
BDBM50051456
NameBDBM50051456
Synonyms:CHEMBL306344 | N-(2,6-Diisopropyl-phenyl)-2-(2-dodecyl-2H-tetrazol-5-yl)-2-phenyl-acetamide
TypeSmall organic molecule
Emp. Form.C33H49N5O
Mol. Mass.531.7751
SMILESCCCCCCCCCCCCn1nnc(n1)C(C(=O)Nc1c(cccc1C(C)C)C(C)C)c1ccccc1