Reaction Details
TargetSterol O-acyltransferase 1
LigandBDBM50051460
Substrate/Competitorn/a
Meas. Tech.ChEMBL_28484 (CHEMBL646055)
IC50 24±n/a nM
Citation O'Brien, PMSliskovic, DRBernabei, AHurley, TAnderson, MKBousley, RFKrause, BKStanfield, RL Inhibitors of acyl-CoA: Cholesterol O-acyl transferase (ACAT) as hypocholesterolemic agents. 13. Design, synthesis and biological evaluation of tetrazole anilides as potent inhibitors of ACAT in vitro and hypocholesterolemic agents in vivo Bioorg Med Chem Lett5:295-300 (1995)  
 
Sterol O-acyltransferase 1
Name:Sterol O-acyltransferase 1
Type:PROTEIN
Mol. Mass.:64165.56
Organism:Rattus norvegicus
Description:ChEMBL_28796
Residue:545
BDBM50051460
NameBDBM50051460
Synonyms:2-(2-Dodecyl-2H-tetrazol-5-yl)-2-phenyl-N-(2,4,6-trimethoxy-phenyl)-acetamide | CHEMBL77370
TypeSmall organic molecule
Emp. Form.C30H43N5O4
Mol. Mass.537.6935
SMILESCCCCCCCCCCCCn1nnc(n1)C(C(=O)Nc1c(OC)cc(OC)cc1OC)c1ccccc1