Reaction Details
TargetCaspase-1
LigandBDBM50286304
Substrate/Competitorn/a
Meas. Tech.ChEBML_90976
Ki 15±n/a nM
Citation Prasad, CVProuty, CPHoyer, DRoss, TMSalvino, JMAwad, MGraybill, TLSchmidt, SJOsifo, IKDolle, REHelaszek, CTMiller, REAtor, MA Structural and stereochemical requirements of time-dependent inactivators of the interleukin-1β converting enzyme Bioorg Med Chem Lett5:315-318 (1995)    Article
 
Caspase-1
Name:Caspase-1
Type:Enzyme
Mol. Mass.:45154.13
Organism:Homo sapiens (Human)
Description:P29466
Residue:404
BDBM50286304
NameBDBM50286304
Synonyms:(R)-3-[(S)-2-((S)-2-Benzyloxycarbonylamino-3-methyl-butyrylamino)-propionylamino]-4-oxo-butyric acid | CHEMBL108082
TypeSmall organic molecule
Emp. Form.C20H27N3O7
Mol. Mass.421.4443
SMILESCC(C)[C@H](NC(=O)OCc1ccccc1)C(=O)N[C@@H](C)C(=O)N[C@H](CC(O)=O)C=O