Reaction Details
TargetNeutrophil elastase
LigandBDBM50286305
Substrate/Competitorn/a
Meas. Tech.ChEBML_219643
Ki 0.800000±n/a nM
Citation Subramanyam, CBell, MRFerguson, EGordon, RGDunlap, RPFranke, CMura, AJ Inhibitors of human leukocyte elastase. 2.1 synthesis and sar of benzisothiazolinylmethyl aryl ethers Bioorg Med Chem Lett5:319-324 (1995)    Article
 
Neutrophil elastase
Name:Neutrophil elastase
Type:Enzyme
Mol. Mass.:28532.38
Organism:Homo sapiens (Human)
Description:P08246
Residue:267
BDBM50286305
NameBDBM50286305
Synonyms:2-[2-Chloro-4-(morpholine-4-sulfonyl)-phenoxymethyl]-4-isopropyl-1,1-dioxo-1,2-dihydro-1lambda*6*-benzo[d]isothiazol-3-one | CHEMBL109234
TypeSmall organic molecule
Emp. Form.C21H23ClN2O7S2
Mol. Mass.515
SMILESCC(C)c1cccc2c1C(=O)N(COc1ccc(cc1Cl)S(=O)(=O)N1CCOCC1)S2(=O)=O