Reaction Details
TargetNeutrophil elastase
LigandBDBM50005147
Substrate/Competitorn/a
Meas. Tech.ChEBML_86691
Ki 0.400000±n/a nM
Citation Subramanyam, CBell, MRGhose, AKKumar, VDunlap, RPFranke, CMura, AJ Inhibitors of human leukocyte elastase. 3.1 inhibition by tetrahydrobenzisothiazolinylmethyl aryl carboxylates Bioorg Med Chem Lett5:325-330 (1995)    Article
 
Neutrophil elastase
Name:Neutrophil elastase
Type:Enzyme
Mol. Mass.:28532.38
Organism:Homo sapiens (Human)
Description:P08246
Residue:267
BDBM50005147
NameBDBM50005147
Synonyms:(S)-1-{(S)-2-[4-(4-Bromo-benzenesulfonylaminocarbonyl)-benzoylamino]-3-methyl-butyryl}-pyrrolidine-2-carboxylic acid (3,3,3-trifluoro-1-isopropyl-2-oxo-propyl)-amide CHEMBL3085439 | ICI-200355
TypeSmall organic molecule
Emp. Form.C30H34BrF3N4O7S
Mol. Mass.731.578
SMILESCC(C)C(NC(=O)c1ccc(cc1)C(=O)NS(=O)(=O)c1ccc(Br)cc1)C(=O)N1CCC[C@H]1C(=O)N[C@@H](C(C)C)C(=O)C(F)(F)F