Reaction Details
TargetCalpain-1 catalytic subunit
LigandBDBM50286427
Substrate/Competitorn/a
Meas. Tech.ChEBML_43649
IC50 30000±n/a nM
Citation Graybill, TLDolle, REOsifo, IKSchmidt, SJGregory, JSHarris, ALMiller, MS Inhibition of human erythrocyte calpain I by novel quinolinecarboxamides Bioorg Med Chem Lett5:387-392 (1995)    Article
 
Calpain-1 catalytic subunit
Name:Calpain-1 catalytic subunit
Type:Protein
Mol. Mass.:81880.51
Organism:Homo sapiens (Human)
Description:n/a
Residue:714
BDBM50286427
NameBDBM50286427
Synonyms:1-(2-Chloro-4-hydroxy-phenyl)-7-(2-fluoro-pyridin-4-yl)-4-oxo-1,4-dihydro-quinoline-3-carboxylic acid amide | CHEMBL126718
TypeSmall organic molecule
Emp. Form.C21H13ClFN3O3
Mol. Mass.409.798
SMILESNC(=O)c1cn(-c2ccc(O)cc2Cl)c2cc(ccc2c1=O)-c1ccnc(F)c1