Reaction Details
TargetMu-type opioid receptor
LigandBDBM50286581
Substrate/Competitorn/a
Meas. Tech.ChEBML_138998
Ki 390±n/a nM
Citation Napoletano, MDelia, BDFraire, CGrancini, GMasotto, CRicciardi, SZambon, C Stereoselective synthesis and evaluation of all stereoisomers of Z4349, a novel and selective μ-opioid analgesic Bioorg Med Chem Lett5:589-592 (1995)    Article
 
Mu-type opioid receptor
Name:Mu-type opioid receptor
Type:G Protein-Coupled Receptor (GPCR)
Mol. Mass.:44503.11
Organism:Rattus norvegicus (rat)
Description:Competition binding assays were carried out using membrane preparations from transfected HN9.10 cells that constitutively expressed the mu opioid receptor.
Residue:398
BDBM50286581
NameBDBM50286581
Synonyms:(S)-5-{(R)-2-[Bis-((R)-sec-butyl)-amino]-1-hydroxy-ethyl}-1-(2-chloro-benzyl)-pyrrolidin-2-one | CHEMBL346240
TypeSmall organic molecule
Emp. Form.C21H33ClN2O2
Mol. Mass.380.952
SMILESCC[C@@H](C)N(C[C@@H](O)[C@@H]1CCC(=O)N1Cc1ccccc1Cl)[C@H](C)CC