Reaction Details
TargetKappa-type opioid receptor
LigandBDBM50286582
Substrate/Competitorn/a
Meas. Tech.ChEBML_145841
Ki>5000±n/a nM
Citation Napoletano, MDelia, BDFraire, CGrancini, GMasotto, CRicciardi, SZambon, C Stereoselective synthesis and evaluation of all stereoisomers of Z4349, a novel and selective μ-opioid analgesic Bioorg Med Chem Lett5:589-592 (1995)    Article
 
Kappa-type opioid receptor
Name:Kappa-type opioid receptor
Type:G Protein-Coupled Receptor (GPCR)
Mol. Mass.:42692.90
Organism:Rattus norvegicus (rat)
Description:P34975
Residue:380
BDBM50286582
NameBDBM50286582
Synonyms:(S)-5-{(S)-2-[Bis-((S)-sec-butyl)-amino]-1-hydroxy-ethyl}-1-(2-chloro-benzyl)-pyrrolidin-2-one | CHEMBL345163
TypeSmall organic molecule
Emp. Form.C21H33ClN2O2
Mol. Mass.380.952
SMILESCC[C@H](C)N(C[C@H](O)[C@@H]1CCC(=O)N1Cc1ccccc1Cl)[C@@H](C)CC