Reaction Details
Target5-hydroxytryptamine receptor 1D
LigandBDBM50033439
Substrate/Competitorn/a
Meas. Tech.ChEMBL_201049 (CHEMBL803826)
EC50 0.450000±n/a nM
Citation Perez, MPauwels, PPalmier, CJohn, GWValentin, JPHalazy, S 5-O-Carboxymethyl piperazide derivatives of serotonin: a new class of potent and selective 5-HT1D receptor agonists Bioorg Med Chem Lett5:663-666 (1995)    Article
 
5-hydroxytryptamine receptor 1D
Name:5-hydroxytryptamine receptor 1D
Type:G Protein-Coupled Receptor (GPCR)
Mol. Mass.:41920.63
Organism:Homo sapiens (Human)
Description:Receptor binding assays were performed using human clone stably expressed in CHO cells.
Residue:377
BDBM50033439
NameBDBM50033439
Synonyms:2-[3-(2-Amino-ethyl)-1H-indol-5-yloxy]-1-(4-phenyl-piperazin-1-yl)-ethanone | CHEMBL421064
TypeSmall organic molecule
Emp. Form.C22H26N4O2
Mol. Mass.378.4674
SMILESNCCc1c[nH]c2ccc(OCC(=O)N3CCN(CC3)c3ccccc3)cc12