Reaction Details
Target5-hydroxytryptamine receptor 1D
LigandBDBM50033447
Substrate/Competitorn/a
Meas. Tech.ChEMBL_1998 (CHEMBL617091)
Ki 2.1±n/a nM
Citation Perez, MPauwels, PPalmier, CJohn, GWValentin, JPHalazy, S 5-O-Carboxymethyl piperazide derivatives of serotonin: a new class of potent and selective 5-HT1D receptor agonists Bioorg Med Chem Lett5:663-666 (1995)    Article
 
5-hydroxytryptamine receptor 1D
Name:5-hydroxytryptamine receptor 1D
Type:G Protein-Coupled Receptor (GPCR)
Mol. Mass.:41920.63
Organism:Homo sapiens (Human)
Description:Receptor binding assays were performed using human clone stably expressed in CHO cells.
Residue:377
BDBM50033447
NameBDBM50033447
Synonyms:2-[3-(2-Amino-ethyl)-1H-indol-5-yloxy]-1-(4-o-tolyl-piperazin-1-yl)-ethanone CHEMBL321818
TypeSmall organic molecule
Emp. Form.C23H28N4O2
Mol. Mass.392.494
SMILESCc1ccccc1N1CCN(CC1)C(=O)COc1ccc2[nH]cc(CCN)c2c1