Reaction Details
TargetMuscarinic acetylcholine receptor M4
LigandBDBM50033447
Substrate/Competitorn/a
Meas. Tech.ChEBML_138340
IC50>10000±n/a nM
Citation Perez, MPauwels, PPalmier, CJohn, GWValentin, JPHalazy, S 5-O-Carboxymethyl piperazide derivatives of serotonin: a new class of potent and selective 5-HT1D receptor agonists Bioorg Med Chem Lett5:663-666 (1995)    Article
 
Muscarinic acetylcholine receptor M4
Name:Muscarinic acetylcholine receptor M4
Type:Enzyme Catalytic Domain
Mol. Mass.:53079.31
Organism:Homo sapiens (Human)
Description:Cholinergic, muscarinic M4 CHRM4 HUMAN M3::P08173
Residue:479
BDBM50033447
NameBDBM50033447
Synonyms:2-[3-(2-Amino-ethyl)-1H-indol-5-yloxy]-1-(4-o-tolyl-piperazin-1-yl)-ethanone CHEMBL321818
TypeSmall organic molecule
Emp. Form.C23H28N4O2
Mol. Mass.392.494
SMILESCc1ccccc1N1CCN(CC1)C(=O)COc1ccc2[nH]cc(CCN)c2c1