Reaction Details
TargetLeukotriene B4 receptor 1
LigandBDBM50286750
Substrate/Competitorn/a
Meas. Tech.ChEBML_99655
Ki 16000±n/a nM
Citation Masamune, HBreslow, RCheng, JBConklyn, MJEggler, JFMarfat, AMelvin, LSPillar, JSShirley, JTShowell, HJTickner, JE Synthesis and in vitro profile of 7-substituted quinoline chromanols as novel, non-acidic LTB4 antagonists Bioorg Med Chem Lett5:887-892 (1995)    Article
 
Leukotriene B4 receptor 1
Name:Leukotriene B4 receptor 1
Type:Enzyme Catalytic Domain
Mol. Mass.:37582.68
Organism:Homo sapiens (Human)
Description:Q15722
Residue:352
BDBM50286750
NameBDBM50286750
Synonyms:(3R,4S)-3-Pyridin-3-ylmethyl-6-(quinolin-2-ylmethoxy)-chroman-4-ol | CHEMBL414462
TypeSmall organic molecule
Emp. Form.C25H22N2O3
Mol. Mass.398.4538
SMILESO[C@H]1[C@H](Cc2cccnc2)COc2ccc(OCc3ccc4ccccc4n3)cc12