Reaction Details
TargetLeukotriene B4 receptor 1
LigandBDBM50001610
Substrate/Competitorn/a
Meas. Tech.ChEMBL_99655 (CHEMBL704421)
IC50 140±n/a nM
Citation Masamune, HBreslow, RCheng, JBConklyn, MJEggler, JFMarfat, AMelvin, LSPillar, JSShirley, JTShowell, HJTickner, JE Synthesis and in vitro profile of 7-substituted quinoline chromanols as novel, non-acidic LTB4 antagonists Bioorg Med Chem Lett5:887-892 (1995)    Article
 
Leukotriene B4 receptor 1
Name:Leukotriene B4 receptor 1
Type:Enzyme Catalytic Domain
Mol. Mass.:37582.68
Organism:Homo sapiens (Human)
Description:Q15722
Residue:352
BDBM50001610
NameBDBM50001610
Synonyms:7-[3-(4-Acetyl-3-methoxy-2-propyl-phenoxy)-propoxy]-8-propyl-chroman-2-carboxylic acid CGS 24115 SC-41930
TypeSmall organic molecule
Emp. Form.C28H36O7
Mol. Mass.484.5812
SMILESCCCc1c(OCCCOc2ccc3CCC(Oc3c2CCC)C(O)=O)ccc(C(C)=O)c1OC