Reaction Details
TargetDopamine beta-hydroxylase
LigandBDBM50286806
Substrate/Competitorn/a
Meas. Tech.ChEBML_59304
Ki 3030000±n/a nM
Citation Eydoux, FChlenov, MARéglier, M Synthesis of indane derivatives as mechanism-based inhibitors of dopamine β-hydroxylase Bioorg Med Chem Lett5:941-944 (1995)    Article
 
Dopamine beta-hydroxylase
Name:Dopamine beta-hydroxylase
Type:PROTEIN
Mol. Mass.:68136.39
Organism:Bos taurus
Description:ChEMBL_50738
Residue:610
BDBM50286806
NameBDBM50286806
Synonyms:1,1a,6,6a-Tetrahydro-cyclopropa[a]indene | CHEMBL172143
TypeSmall organic molecule
Emp. Form.C10H10
Mol. Mass.130.1864
SMILESC1C2Cc3ccccc3C12