Reaction Details
TargetDopamine beta-hydroxylase
LigandBDBM50286807
Substrate/Competitorn/a
Meas. Tech.ChEBML_59304
Ki 109000±n/a nM
Citation Eydoux, FChlenov, MARéglier, M Synthesis of indane derivatives as mechanism-based inhibitors of dopamine β-hydroxylase Bioorg Med Chem Lett5:941-944 (1995)    Article
 
Dopamine beta-hydroxylase
Name:Dopamine beta-hydroxylase
Type:PROTEIN
Mol. Mass.:68136.39
Organism:Bos taurus
Description:ChEMBL_50738
Residue:610
BDBM50286807
NameBDBM50286807
Synonyms:1,1a,6,6a-Tetrahydro-cyclopropa[a]indene-3,4-diol | CHEMBL174210
TypeSmall organic molecule
Emp. Form.C10H10O2
Mol. Mass.162.1852
SMILESOc1cc2CC3CC3c2cc1O