Reaction Details
TargetDopamine beta-hydroxylase
LigandBDBM50286811
Substrate/Competitorn/a
Meas. Tech.ChEBML_59304
Ki 650000±n/a nM
Citation Eydoux, FChlenov, MARéglier, M Synthesis of indane derivatives as mechanism-based inhibitors of dopamine β-hydroxylase Bioorg Med Chem Lett5:941-944 (1995)    Article
 
Dopamine beta-hydroxylase
Name:Dopamine beta-hydroxylase
Type:PROTEIN
Mol. Mass.:68136.39
Organism:Bos taurus
Description:ChEMBL_50738
Residue:610
BDBM50286811
NameBDBM50286811
Synonyms:3-Methoxy-6,6a-dihydro-1aH-1-oxa-cyclopropa[a]indene | CHEMBL174285
TypeSmall organic molecule
Emp. Form.C10H10O2
Mol. Mass.162.1852
SMILESCOc1ccc2CC3OC3c2c1