Reaction Details
TargetDopamine beta-hydroxylase
LigandBDBM50286812
Substrate/Competitorn/a
Meas. Tech.ChEBML_59304
Ki 1060000±n/a nM
Citation Eydoux, FChlenov, MARéglier, M Synthesis of indane derivatives as mechanism-based inhibitors of dopamine β-hydroxylase Bioorg Med Chem Lett5:941-944 (1995)    Article
 
Dopamine beta-hydroxylase
Name:Dopamine beta-hydroxylase
Type:PROTEIN
Mol. Mass.:68136.39
Organism:Bos taurus
Description:ChEMBL_50738
Residue:610
BDBM50286812
NameBDBM50286812
Synonyms:6,6a-Dihydro-1aH-1-oxa-cyclopropa[a]indene | CHEMBL170741
TypeSmall organic molecule
Emp. Form.C9H8O
Mol. Mass.132.1592
SMILESC1C2OC2c2ccccc12