Reaction Details
TargetDopamine beta-hydroxylase
LigandBDBM50023371
Substrate/Competitorn/a
Meas. Tech.ChEBML_59304
Ki 12000000±n/a nM
Citation Eydoux, FChlenov, MARéglier, M Synthesis of indane derivatives as mechanism-based inhibitors of dopamine β-hydroxylase Bioorg Med Chem Lett5:941-944 (1995)    Article
 
Dopamine beta-hydroxylase
Name:Dopamine beta-hydroxylase
Type:PROTEIN
Mol. Mass.:68136.39
Organism:Bos taurus
Description:ChEMBL_50738
Residue:610
BDBM50023371
NameBDBM50023371
Synonyms:4-Cyclopropylmethyl-phenol | CHEMBL162030
TypeSmall organic molecule
Emp. Form.C10H12O
Mol. Mass.148.2017
SMILESOc1ccc(CC2CC2)cc1