Reaction Details
TargetGastrin/cholecystokinin type B receptor
LigandBDBM50286894
Substrate/Competitorn/a
Meas. Tech.ChEBML_48441
IC50 18±n/a nM
Citation Semple, GRyder, HKendrick, DASzelke, MOhta, MSatoh, MNishida, AAkuzawa, SMiyata, K Synthesis and biological activity of 5-heteroaryl benzodiazepines: analogues of YM022 Bioorg Med Chem Lett6:55-58 (1996)    Article
 
Gastrin/cholecystokinin type B receptor
Name:Gastrin/cholecystokinin type B receptor
Type:Enzyme Catalytic Domain
Mol. Mass.:48980.43
Organism:RAT
Description:Cholecystokinin A CCKBR RAT::P30553
Residue:452
BDBM50286894
NameBDBM50286894
Synonyms:1-[2-Oxo-1-(2-oxo-2-o-tolyl-ethyl)-5-pyridin-4-yl-2,3-dihydro-1H-benzo[e][1,4]diazepin-3-yl]-3-m-tolyl-urea | CHEMBL538912
TypeSmall organic molecule
Emp. Form.C31H27N5O3
Mol. Mass.517.5778
SMILESCc1cccc(NC(=O)NC2N=C(c3ccncc3)c3ccccc3N(CC(=O)c3ccccc3C)C2=O)c1