Reaction Details
TargetCholecystokinin receptor type A
LigandBDBM50286896
Substrate/Competitorn/a
Meas. Tech.ChEBML_50038
IC50 433±n/a nM
Citation Semple, GRyder, HKendrick, DASzelke, MOhta, MSatoh, MNishida, AAkuzawa, SMiyata, K Synthesis and biological activity of 5-heteroaryl benzodiazepines: analogues of YM022 Bioorg Med Chem Lett6:55-58 (1996)    Article
 
Cholecystokinin receptor type A
Name:Cholecystokinin receptor type A
Type:Enzyme Catalytic Domain
Mol. Mass.:49676.37
Organism:RAT
Description:Cholecystokinin central 0 RAT::P30551
Residue:444
BDBM50286896
NameBDBM50286896
Synonyms:1-(3,3-Dimethyl-2-oxo-butyl)-5-thiazol-2-yl-3-[(m-tolylamino-methyl)-amino]-1,3-dihydro-benzo[e][1,4]diazepin-2-one | CHEMBL435447
TypeSmall organic molecule
Emp. Form.C26H29N5O2S
Mol. Mass.475.606
SMILESCc1cccc(NCNC2N=C(c3nccs3)c3ccccc3N(CC(=O)C(C)(C)C)C2=O)c1