Reaction Details
TargetGastrin/cholecystokinin type B receptor
LigandBDBM50286898
Substrate/Competitorn/a
Meas. Tech.ChEBML_48441
IC50 4.5±n/a nM
Citation Semple, GRyder, HKendrick, DASzelke, MOhta, MSatoh, MNishida, AAkuzawa, SMiyata, K Synthesis and biological activity of 5-heteroaryl benzodiazepines: analogues of YM022 Bioorg Med Chem Lett6:55-58 (1996)    Article
 
Gastrin/cholecystokinin type B receptor
Name:Gastrin/cholecystokinin type B receptor
Type:Enzyme Catalytic Domain
Mol. Mass.:48980.43
Organism:RAT
Description:Cholecystokinin A CCKBR RAT::P30553
Residue:452
BDBM50286898
NameBDBM50286898
Synonyms:1-[1-(3,3-Dimethyl-2-oxo-butyl)-5-(1-methyl-1H-imidazol-2-yl)-2-oxo-2,3-dihydro-1H-benzo[e][1,4]diazepin-3-yl]-3-m-tolyl-urea | CHEMBL155627
TypeSmall organic molecule
Emp. Form.C27H30N6O3
Mol. Mass.486.5655
SMILESCc1cccc(NC(=O)NC2N=C(c3nccn3C)c3ccccc3N(CC(=O)C(C)(C)C)C2=O)c1