Reaction Details
TargetCholecystokinin receptor type A
LigandBDBM50286900
Substrate/Competitorn/a
Meas. Tech.ChEBML_50038
IC50 80±n/a nM
Citation Semple, GRyder, HKendrick, DASzelke, MOhta, MSatoh, MNishida, AAkuzawa, SMiyata, K Synthesis and biological activity of 5-heteroaryl benzodiazepines: analogues of YM022 Bioorg Med Chem Lett6:55-58 (1996)    Article
 
Cholecystokinin receptor type A
Name:Cholecystokinin receptor type A
Type:Enzyme Catalytic Domain
Mol. Mass.:49676.37
Organism:RAT
Description:Cholecystokinin central 0 RAT::P30551
Residue:444
BDBM50286900
NameBDBM50286900
Synonyms:1-[1-(2-Cyclopentyl-2-oxo-ethyl)-2-oxo-5-pyridin-3-yl-2,3-dihydro-1H-benzo[e][1,4]diazepin-3-yl]-3-m-tolyl-urea | CHEMBL347843
TypeSmall organic molecule
Emp. Form.C29H29N5O3
Mol. Mass.495.5723
SMILESCc1cccc(NC(=O)NC2N=C(c3cccnc3)c3ccccc3N(CC(=O)C3CCCC3)C2=O)c1