Reaction Details
TargetCholecystokinin receptor type A
LigandBDBM50056097
Substrate/Competitorn/a
Meas. Tech.ChEBML_50038
IC50 111±n/a nM
Citation Semple, GRyder, HKendrick, DASzelke, MOhta, MSatoh, MNishida, AAkuzawa, SMiyata, K Synthesis and biological activity of 5-heteroaryl benzodiazepines: analogues of YM022 Bioorg Med Chem Lett6:55-58 (1996)    Article
 
Cholecystokinin receptor type A
Name:Cholecystokinin receptor type A
Type:Enzyme Catalytic Domain
Mol. Mass.:49676.37
Organism:RAT
Description:Cholecystokinin central 0 RAT::P30551
Residue:444
BDBM50056097
NameBDBM50056097
Synonyms:1-[(R)-1-(3,3-Dimethyl-2-oxo-butyl)-2-oxo-5-phenyl-2,3-dihydro-1H-benzo[e][1,4]diazepin-3-yl]-3-m-tolyl-urea | CHEMBL115772
TypeSmall organic molecule
Emp. Form.C29H30N4O3
Mol. Mass.482.5735
SMILESCc1cccc(NC(=O)N[C@@H]2N=C(c3ccccc3)c3ccccc3N(CC(=O)C(C)(C)C)C2=O)c1