Reaction Details
TargetGastrin/cholecystokinin type B receptor
LigandBDBM50286895
Substrate/Competitorn/a
Meas. Tech.ChEBML_48441
IC50>100±n/a nM
Citation Semple, GRyder, HKendrick, DASzelke, MOhta, MSatoh, MNishida, AAkuzawa, SMiyata, K Synthesis and biological activity of 5-heteroaryl benzodiazepines: analogues of YM022 Bioorg Med Chem Lett6:55-58 (1996)    Article
 
Gastrin/cholecystokinin type B receptor
Name:Gastrin/cholecystokinin type B receptor
Type:Enzyme Catalytic Domain
Mol. Mass.:48980.43
Organism:RAT
Description:Cholecystokinin A CCKBR RAT::P30553
Residue:452
BDBM50286895
NameBDBM50286895
Synonyms:1-(3,3-Dimethyl-2-oxo-butyl)-5-(1H-pyrazol-3-yl)-3-[(m-tolylamino-methyl)-amino]-1,3-dihydro-benzo[e][1,4]diazepin-2-one | CHEMBL345880
TypeSmall organic molecule
Emp. Form.C26H30N6O2
Mol. Mass.458.5554
SMILESCc1cccc(NCNC2N=C(c3ccn[nH]3)c3ccccc3N(CC(=O)C(C)(C)C)C2=O)c1