Reaction Details
TargetD(3) dopamine receptor
LigandBDBM50287176
Substrate/Competitorn/a
Meas. Tech.ChEBML_62290
Ki 39±n/a nM
Citation Glase, SAAkunne, HCHeffner, TGJohnson, SJKesten, SRMacKenzie, RGManley, PJPugsley, TAWright, JLWise, LD 4-bromo-1-methoxy-N-[2-(4-aryl-1-piperazinyl)ethyl]-2-naphthalenecarboxamides: Selective dopamine D3 receptor partial agonists Bioorg Med Chem Lett6:1361-1366 (1996)    Article
 
D(3) dopamine receptor
Name:D(3) dopamine receptor
Type:n/a
Mol. Mass.:44243.43
Organism:Homo sapiens (Human)
Description:n/a
Residue:400
BDBM50287176
NameBDBM50287176
Synonyms:4-Bromo-1-methoxy-naphthalene-2-carboxylic acid {2-[4-(2-chloro-phenyl)-piperazin-1-yl]-ethyl}-amide | CHEMBL30206
TypeSmall organic molecule
Emp. Form.C24H25BrClN3O2
Mol. Mass.502.831
SMILESCOc1c(cc(Br)c2ccccc12)C(=O)NCCN1CCN(CC1)c1ccccc1Cl