Reaction Details
TargetD(2) dopamine receptor
LigandBDBM50287179
Substrate/Competitorn/a
Meas. Tech.ChEBML_60231
Ki 71±n/a nM
Citation Glase, SAAkunne, HCHeffner, TGJohnson, SJKesten, SRMacKenzie, RGManley, PJPugsley, TAWright, JLWise, LD 4-bromo-1-methoxy-N-[2-(4-aryl-1-piperazinyl)ethyl]-2-naphthalenecarboxamides: Selective dopamine D3 receptor partial agonists Bioorg Med Chem Lett6:1361-1366 (1996)    Article
 
D(2) dopamine receptor
Name:D(2) dopamine receptor
Type:Cell-surface receptors
Mol. Mass.:50647.10
Organism:Homo sapiens (Human)
Description:P14416
Residue:443
BDBM50287179
NameBDBM50287179
Synonyms:4-Cyano-1-methoxy-naphthalene-2-carboxylic acid [2-(4-phenyl-piperazin-1-yl)-ethyl]-amide | CHEMBL282083
TypeSmall organic molecule
Emp. Form.C25H26N4O2
Mol. Mass.414.4995
SMILESCOc1c(cc(C#N)c2ccccc12)C(=O)NCCN1CCN(CC1)c1ccccc1