Reaction Details
TargetAdenosylhomocysteinase
LigandBDBM50240434
Substrate/Competitorn/a
Meas. Tech.ChEMBL_196586 (CHEMBL800464)
Ki 0.500000±n/a nM
Citation Neenan, JPOpitz, SMCooke, CLUssery, MAMorrill, TCEckel, LM Adenosine dialdehyde analogs I: Regioselective synthesis of adenosine monoaldehydes Bioorg Med Chem Lett6:1381-1386 (1996)    Article
 
Adenosylhomocysteinase
Name:Adenosylhomocysteinase
Type:PROTEIN
Mol. Mass.:47714.06
Organism:Homo sapiens (Human)
Description:ChEMBL_1507791
Residue:432
BDBM50240434
NameBDBM50240434
Synonyms:2-[1-(6-Amino-purin-9-yl)-2-oxo-ethoxy]-propenal | CHEMBL280595
TypeSmall organic molecule
Emp. Form.C10H9N5O3
Mol. Mass.247.2102
SMILESNc1ncnc2n(cnc12)C(OC(=C)C=O)C=O