Reaction Details
TargetProthrombin
LigandBDBM50287480
Substrate/Competitorn/a
Meas. Tech.ChEMBL_207964 (CHEMBL815791)
IC50 410±n/a nM
Citation Steinmetzer, TKonishi, Y Tripeptidyl pyridinium methyl ketones as potent active site inhibitors of thrombin Bioorg Med Chem Lett6:1677-1682 (1996)    Article
 
Prothrombin
Name:Prothrombin
Type:Protein
Mol. Mass.:70029.57
Organism:Homo sapiens (Human)
Description:P00734
Residue:622
BDBM50287480
NameBDBM50287480
Synonyms:(S)-1-((R)-2-Amino-3-cyclohexyl-propionyl)-pyrrolidine-2-carboxylic acid ((S)-1-acetyl-4-guanidino-butyl)-amide | CHEMBL297981
TypeSmall organic molecule
Emp. Form.C21H38N6O3
Mol. Mass.422.5648
SMILESCC(=O)[C@H](CCCNC(N)=N)NC(=O)[C@@H]1CCCN1C(=O)[C@H](N)CC1CCCCC1