Reaction Details
TargetProthrombin
LigandBDBM50287479
Substrate/Competitorn/a
Meas. Tech.ChEMBL_208346 (CHEMBL813656)
Ki 185±n/a nM
Citation Steinmetzer, TKonishi, Y Tripeptidyl pyridinium methyl ketones as potent active site inhibitors of thrombin Bioorg Med Chem Lett6:1677-1682 (1996)    Article
 
Prothrombin
Name:Prothrombin
Type:Protein
Mol. Mass.:70029.57
Organism:Homo sapiens (Human)
Description:P00734
Residue:622
BDBM50287479
NameBDBM50287479
Synonyms:(S)-1-((R)-2-Acetylamino-3-cyclohexyl-propionyl)-pyrrolidine-2-carboxylic acid ((S)-4-guanidino-1-phenylacetyl-butyl)-amide | CHEMBL47824
TypeSmall organic molecule
Emp. Form.C29H44N6O4
Mol. Mass.540.6975
SMILESCC(=O)N[C@H](CC1CCCCC1)C(=O)N1CCC[C@H]1C(=O)N[C@@H](CCCNC(N)=N)C(=O)Cc1ccccc1