Reaction Details
TargetProthrombin
LigandBDBM50287477
Substrate/Competitorn/a
Meas. Tech.ChEBML_207964
IC50 9.9±n/a nM
Citation Steinmetzer, TKonishi, Y Tripeptidyl pyridinium methyl ketones as potent active site inhibitors of thrombin Bioorg Med Chem Lett6:1677-1682 (1996)    Article
 
Prothrombin
Name:Prothrombin
Type:Protein
Mol. Mass.:70029.57
Organism:Homo sapiens (Human)
Description:P00734
Residue:622
BDBM50287477
NameBDBM50287477
Synonyms:(S)-1-((R)-2-Amino-3-cyclohexyl-propionyl)-pyrrolidine-2-carboxylic acid ((S)-4-guanidino-1-phenylacetyl-butyl)-amide | CHEMBL44980
TypeSmall organic molecule
Emp. Form.C27H42N6O3
Mol. Mass.498.6608
SMILESN[C@H](CC1CCCCC1)C(=O)N1CCC[C@H]1C(=O)N[C@@H](CCCNC(N)=N)C(=O)Cc1ccccc1