Reaction Details
TargetProthrombin
LigandBDBM50287476
Substrate/Competitorn/a
Meas. Tech.ChEBML_207964
IC50 1.7±n/a nM
Citation Steinmetzer, TKonishi, Y Tripeptidyl pyridinium methyl ketones as potent active site inhibitors of thrombin Bioorg Med Chem Lett6:1677-1682 (1996)    Article
 
Prothrombin
Name:Prothrombin
Type:Protein
Mol. Mass.:70029.57
Organism:Homo sapiens (Human)
Description:P00734
Residue:622
BDBM50287476
NameBDBM50287476
Synonyms:1-((S)-3-{[(S)-1-((R)-2-Amino-3-cyclohexyl-propionyl)-pyrrolidine-2-carbonyl]-amino}-6-guanidino-2-oxo-hexyl)-pyridinium | CHEMBL295863
TypeSmall organic molecule
Emp. Form.C26H42N7O3
Mol. Mass.500.6562
SMILESN[C@H](CC1CCCCC1)C(=O)N1CCC[C@H]1C(=O)N[C@@H](CCCNC(N)=N)C(=O)C[n+]1ccccc1