Reaction Details
TargetProthrombin
LigandBDBM50287475
Substrate/Competitorn/a
Meas. Tech.ChEBML_207964
IC50 180±n/a nM
Citation Steinmetzer, TKonishi, Y Tripeptidyl pyridinium methyl ketones as potent active site inhibitors of thrombin Bioorg Med Chem Lett6:1677-1682 (1996)    Article
 
Prothrombin
Name:Prothrombin
Type:Protein
Mol. Mass.:70029.57
Organism:Homo sapiens (Human)
Description:P00734
Residue:622
BDBM50287475
NameBDBM50287475
Synonyms:1-((S)-3-{[(S)-1-((R)-2-Acetylamino-3-cyclohexyl-propionyl)-pyrrolidine-2-carbonyl]-amino}-6-guanidino-2-oxo-hexyl)-pyridinium | CHEMBL294946
TypeSmall organic molecule
Emp. Form.C28H44N7O4
Mol. Mass.542.6929
SMILESCC(=O)N[C@H](CC1CCCCC1)C(=O)N1CCC[C@H]1C(=O)N[C@@H](CCCNC(N)=N)C(=O)C[n+]1ccccc1