Reaction Details
TargetProthrombin
LigandBDBM50287478
Substrate/Competitorn/a
Meas. Tech.ChEBML_207964
IC50 2700±n/a nM
Citation Steinmetzer, TKonishi, Y Tripeptidyl pyridinium methyl ketones as potent active site inhibitors of thrombin Bioorg Med Chem Lett6:1677-1682 (1996)    Article
 
Prothrombin
Name:Prothrombin
Type:Protein
Mol. Mass.:70029.57
Organism:Homo sapiens (Human)
Description:P00734
Residue:622
BDBM50287478
NameBDBM50287478
Synonyms:1-((S)-3-{[(S)-1-((R)-2-Acetylamino-3-phenyl-propionyl)-pyrrolidine-2-carbonyl]-amino}-6-guanidino-2-oxo-hexyl)-pyridinium | CHEMBL47574
TypeSmall organic molecule
Emp. Form.C28H38N7O4
Mol. Mass.536.6453
SMILESCC(=O)N[C@H](Cc1ccccc1)C(=O)N1CCC[C@H]1C(=O)N[C@@H](CCCNC(N)=N)C(=O)C[n+]1ccccc1