Reaction Details
TargetCathepsin D
LigandBDBM50287749
Substrate/Competitorn/a
Meas. Tech.ChEBML_45186
IC50 640±n/a nM
Citation Whitesitt, CASimon, RLReel, JKSigmund, SKPhillips, MLShadle, JKHeinz, LJKoppel, GAHunden, DCLifer, SLBerry, DRay, JLittle, SPLiu, XMarshall, WSPanetta, JA Synthesis and structure-activity relationships of benzophenones as inhibitors of cathepsin D Bioorg Med Chem Lett6:2157-2162 (1996)    Article
 
Cathepsin D
Name:Cathepsin D
Type:Enzyme
Mol. Mass.:44551.72
Organism:Homo sapiens (Human)
Description:Human proCathepsin D (SwissProt accession number P07339) was expressed in Sf9 cells, purified, and autoactivated.
Residue:412
BDBM50287749
NameBDBM50287749
Synonyms:5-[1-[4-(4-Acetyl-3-hydroxy-2-propyl-benzyloxy)-phenyl]-meth-(Z)-ylidene]-2-thioxo-thiazolidin-4-one | CHEMBL302534
TypeSmall organic molecule
Emp. Form.C22H21NO4S2
Mol. Mass.427.536
SMILESCCCc1c(O)c(ccc1COc1ccc(C=C2SC(S)=NC2=O)cc1)C(C)=O