Reaction Details
TargetEndothelin-converting enzyme 1
LigandBDBM50287866
Substrate/Competitorn/a
Meas. Tech.ChEBML_64372
IC50 20±n/a nM
Citation Deprez, PGuillaume, JDumas, JVevert, JP Thiol inhibitors of endothelin-converting enzyme Bioorg Med Chem Lett6:2317-2322 (1996)    Article
 
Endothelin-converting enzyme 1
Name:Endothelin-converting enzyme 1
Type:Protein
Mol. Mass.:86126.89
Organism:Rattus norvegicus (Rat)
Description:P42893
Residue:762
BDBM50287866
NameBDBM50287866
Synonyms:(S)-2-[3-(3-Bromo-phenyl)-2-mercaptomethyl-propionylamino]-3-(1H-indol-3-yl)-propionic acid | CHEMBL77682
TypeSmall organic molecule
Emp. Form.C21H21BrN2O3S
Mol. Mass.461.372
SMILESOC(=O)[C@H](Cc1c[nH]c2ccccc12)NC(=O)C(CS)Cc1cccc(Br)c1