Reaction Details
TargetRetinoic acid receptor RXR-alpha
LigandBDBM50403584
Substrate/Competitorn/a
Meas. Tech.ChEMBL_196501 (CHEMBL798315)
Kd>1000±n/a nM
Citation Vuligonda, VLin, YChandraratna, RA Synthesis of highly potent RXR-specific retinoids: The use of a cyclopropyl group as a double bond isostere Bioorg Med Chem Lett6:213-218 (1996)    Article
 
Retinoic acid receptor RXR-alpha
Name:Retinoic acid receptor RXR-alpha
Type:PROTEIN
Mol. Mass.:50820.38
Organism:Homo sapiens (Human)
Description:ChEMBL_1456363
Residue:462
BDBM50403584
NameBDBM50403584
Synonyms:CHEMBL2111534
TypeSmall organic molecule
Emp. Form.C25H34O2
Mol. Mass.366.5363
SMILESC\C(\C=C\C1CC1(C)c1cc2c(cc1C)C(C)(C)CCC2(C)C)=C\C(O)=O