Reaction Details
TargetRetinoic acid receptor gamma
LigandBDBM50287964
Substrate/Competitorn/a
Meas. Tech.ChEBML_196177
Kd>1000±n/a nM
Citation Vuligonda, VLin, YChandraratna, RA Synthesis of highly potent RXR-specific retinoids: The use of a cyclopropyl group as a double bond isostere Bioorg Med Chem Lett6:213-218 (1996)    Article
 
Retinoic acid receptor gamma
Name:Retinoic acid receptor gamma
Type:PROTEIN
Mol. Mass.:50345.43
Organism:Homo sapiens (Human)
Description:ChEMBL_1458016
Residue:454
BDBM50287964
NameBDBM50287964
Synonyms:(E)-3-Methyl-5-[2-methyl-2-(3,5,5,8,8-pentamethyl-5,6,7,8-tetrahydro-naphthalen-2-yl)-cyclopropyl]-penta-2,4-dienoic acid | CHEMBL308883
TypeSmall organic molecule
Emp. Form.C25H34O2
Mol. Mass.366.5363
SMILESC\C(\C=C\C1CC1(C)c1cc2c(cc1C)C(C)(C)CCC2(C)C)=C/C(O)=O