Reaction Details
TargetRetinoic acid receptor RXR-beta
LigandBDBM50403583
Substrate/Competitorn/a
Meas. Tech.ChEBML_196637
Kd>1000±n/a nM
Citation Vuligonda, VLin, YChandraratna, RA Synthesis of highly potent RXR-specific retinoids: The use of a cyclopropyl group as a double bond isostere Bioorg Med Chem Lett6:213-218 (1996)    Article
 
Retinoic acid receptor RXR-beta
Name:Retinoic acid receptor RXR-beta
Type:PROTEIN
Mol. Mass.:56932.89
Organism:Homo sapiens (Human)
Description:ChEMBL_39045
Residue:533
BDBM50403583
NameBDBM50403583
Synonyms:CHEMBL2111535
TypeSmall organic molecule
Emp. Form.C24H32O2
Mol. Mass.352.5097
SMILESC\C(\C=C\C1CC1(C)c1ccc2c(c1)C(C)(C)CCC2(C)C)=C\C(O)=O