Reaction Details
TargetReverse transcriptase/RNaseH
LigandBDBM50288060
Substrate/Competitorn/a
Meas. Tech.ChEBML_195046
IC50>100000±n/a nM
Citation Weaver, RGilbert, IHMahmood, NBalzarini, J Isosteres of nucleoside triphosphates Bioorg Med Chem Lett6:2405-2410 (1996)    Article
 
Reverse transcriptase/RNaseH
Name:Reverse transcriptase/RNaseH
Type:PROTEIN
Mol. Mass.:65229.15
Organism:Human immunodeficiency virus 1
Description:ChEMBL_1473730
Residue:566
BDBM50288060
NameBDBM50288060
Synonyms:2-Hydroxy-2-({[5-(5-methyl-2,4-dioxo-3,4-dihydro-2H-pyrimidin-1-yl)-2,5-dihydro-furan-2-ylmethyl]-carbamoyl}-methyl)-succinic acid dimethyl ester | CHEMBL444054
TypeSmall organic molecule
Emp. Form.C18H23N3O9
Mol. Mass.425.3899
SMILESCOC(=O)CC(O)(CC(=O)NCC1OC(C=C1)n1cc(C)c(=O)[nH]c1=O)C(=O)OC