Reaction Details
TargetAngiotensin-converting enzyme
LigandBDBM50288076
Substrate/Competitorn/a
Meas. Tech.ChEBML_36017
Ki 380±n/a nM
Citation Danvy, DMonteil, TPlaquevent, JCDuhamel, LDuhamel, PGros, CNoël, NSchwartz, JCLecomte, JM Studies on the structural feature of S'1 subsite of neprilysin (EC.3.4.24.11): Stereochemical requirement for the enzyme-inhibitor docking process Bioorg Med Chem Lett6:2437-2440 (1996)    Article
 
Angiotensin-converting enzyme
Name:Angiotensin-converting enzyme
Type:PROTEIN
Mol. Mass.:150907.81
Organism:Rattus norvegicus
Description:ChEMBL_35219
Residue:1313
BDBM50288076
NameBDBM50288076
Synonyms:((E)-2-Mercaptomethyl-3-phenyl-acryloylamino)-acetic acid | CHEMBL81232
TypeSmall organic molecule
Emp. Form.C12H13NO3S
Mol. Mass.251.302
SMILESOC(=O)CNC(=O)C(\CS)=C/c1ccccc1