Reaction Details
TargetGag-Pol polyprotein [489-587]
LigandBDBM161
Substrate/Competitorn/a
Meas. Tech.ChEBML_157739
Ki 0.018000±n/a nM
Citation Rodgers, JDJohnson, BLWang, HGreenberg, RAErickson-Viitanen, SKlabe, RMCordova, BCRayner, MMLam, GNChang, CH Potent cyclic urea HIV protease inhibitors with benzofused heterocycles as P2/P2′ groups Bioorg Med Chem Lett6:2919-2924 (1996)    Article
 
Gag-Pol polyprotein [489-587]
Name:Gag-Pol polyprotein [489-587]
Type:Enzyme Subunit
Mol. Mass.:10781.16
Organism:Human immunodeficiency virus type 1
Description:P04585[489-587]
Residue:99
BDBM161
NameBDBM161
Synonyms:(4R,5S,6S,7R)-4,7-dibenzyl-5,6-dihydroxy-1,3-bis(1H-indazol-5-ylmethyl)-1,3-diazepan-2-one Cyclic Urea | Indazole, 1
Typen/a
Emp. Form.C35H34N6O3
Mol. Mass.586.6829
SMILESO[C@@H]1[C@@H](O)[C@@H](Cc2ccccc2)N(Cc2ccc3[nH]ncc3c2)C(=O)N(Cc2ccc3[nH]ncc3c2)[C@@H]1Cc1ccccc1