Reaction Details
TargetChymotrypsin-like elastase family member 2A
LigandBDBM50282868
Substrate/Competitorn/a
Meas. Tech.ChEBML_158078
Ki 26±n/a nM
KON 130 M-1s-1
Citation Hlasta, DJCourt, JJDesai, RCTalomie, TGShen, JDunlap, RPand, CAMura, AJ A comparative SAR and computer modeling study of benzisothiazolone, mechanism-based inhibitors with porcine pancreatic and human leukocyte elastase Bioorg Med Chem Lett6:2941-2946 (1996)    Article
 
Chymotrypsin-like elastase family member 2A
Name:Chymotrypsin-like elastase family member 2A
Type:PROTEIN
Mol. Mass.:28705.23
Organism:Sus scrofa
Description:ChEMBL_156951
Residue:269
BDBM50282868
NameBDBM50282868
Synonyms:1,1-Dioxo-2-(1-phenyl-1H-tetrazol-5-ylsulfanylmethyl)-4-propyl-1,2-dihydro-1lambda*6*-benzo[d]isothiazol-3-one | CHEMBL299656
TypeSmall organic molecule
Emp. Form.C18H17N5O3S2
Mol. Mass.415.489
SMILESCCCc1cccc2c1C(=O)N(CSc1nnnn1-c1ccccc1)S2(=O)=O