Reaction Details
TargetNeutrophil elastase
LigandBDBM50029703
Substrate/Competitorn/a
Meas. Tech.ChEBML_158078
Ki 0.270000±n/a nM
KON 44500 M-1s-1
Citation Hlasta, DJCourt, JJDesai, RCTalomie, TGShen, JDunlap, RPand, CAMura, AJ A comparative SAR and computer modeling study of benzisothiazolone, mechanism-based inhibitors with porcine pancreatic and human leukocyte elastase Bioorg Med Chem Lett6:2941-2946 (1996)    Article
 
Neutrophil elastase
Name:Neutrophil elastase
Type:Enzyme
Mol. Mass.:28532.38
Organism:Homo sapiens (Human)
Description:P08246
Residue:267
BDBM50029703
NameBDBM50029703
Synonyms:4-Isopropyl-6-methoxy-1,1-dioxo-2-(1-phenyl-1H-tetrazol-5-ylsulfanylmethyl)-1,2-dihydro-1lambda*6*-benzo[d]isothiazol-3-one WIN-63395
TypeSmall organic molecule
Emp. Form.C19H19N5O4S2
Mol. Mass.445.515
SMILESCOc1cc2c(C(=O)N(CSc3nnnn3-c3ccccc3)S2(=O)=O)c(c1)C(C)C