Reaction Details
TargetNeutrophil elastase
LigandBDBM50286327
Substrate/Competitorn/a
Meas. Tech.ChEMBL_63831 (CHEMBL878397)
Ki 0.600000±n/a nM
Citation Hlasta, DJCourt, JJDesai, RCTalomie, TGShen, JDunlap, RPand, CAMura, AJ A comparative SAR and computer modeling study of benzisothiazolone, mechanism-based inhibitors with porcine pancreatic and human leukocyte elastase Bioorg Med Chem Lett6:2941-2946 (1996)    Article
 
Neutrophil elastase
Name:Neutrophil elastase
Type:Enzyme
Mol. Mass.:28532.38
Organism:Homo sapiens (Human)
Description:P08246
Residue:267
BDBM50286327
NameBDBM50286327
Synonyms:4,6-Dimethoxy-1,1-dioxo-2-(1-phenyl-1H-tetrazol-5-ylsulfanylmethyl)-1,2-dihydro-1lambda*6*-benzo[d]isothiazol-3-one | CHEMBL319723
TypeSmall organic molecule
Emp. Form.C17H15N5O5S2
Mol. Mass.433.462
SMILESCOc1cc2c(C(=O)N(CSc3nnnn3-c3ccccc3)S2(=O)=O)c(OC)c1