Reaction Details
TargetProthrombin
LigandBDBM50288619
Substrate/Competitorn/a
Meas. Tech.ChEBML_208898
Ki 0.460000±n/a nM
Citation Fevig, JMAbelman, MMBrittelli, DRKettner, CAKnabb, RMWeber, PC Design and synthesis of ring-constrained boropeptide thrombin inhibitors Bioorg Med Chem Lett6:295-300 (1996)    Article
 
Prothrombin
Name:Prothrombin
Type:Protein
Mol. Mass.:70029.57
Organism:Homo sapiens (Human)
Description:P00734
Residue:622
BDBM50288619
NameBDBM50288619
Synonyms:Boropeptide | CHEMBL3037937
TypeSmall organic molecule
Emp. Form.C22H35BClN3O4
Mol. Mass.451.795
SMILESCl.NCCC[C@H](NC(=O)[C@@H]1CCCN1C(=O)[C@@H]1CCCC[C@H]1c1ccccc1)B(O)O