Reaction Details
TargetProtein kinase C gamma type
LigandBDBM50057512
Substrate/Competitorn/a
Meas. Tech.ChEMBL_161279 (CHEMBL878782)
Ki 53±n/a nM
Citation Irie, KYanai, YOhigashi, HWender, PAMiller, BL Synthesis and characterization of the second cysteine-rich region of mouse skin PKCGh Bioorg Med Chem Lett6:353-356 (1996)    Article
 
Protein kinase C gamma type
Name:Protein kinase C gamma type
Type:PROTEIN
Mol. Mass.:78367.88
Organism:Rattus norvegicus
Description:ChEMBL_152979
Residue:697
BDBM50057512
NameBDBM50057512
Synonyms:(1aR,1bS,4aR,7aS,7bS,8R,9R,9aS)-4a,7b-dihydroxy-3-(hydroxymethyl)-1,1,6,8-tetramethyl-5-oxo-1,1a,1b,4,4a,5,7a,7b,8,9-decahydro-9aH-cyclopropa[3,4]benzo[1,2-e]azulene-9,9a-diyl dibutanoate PDBu phorbol 12,13-dibutyrate
TypeSmall organic molecule
Emp. Form.C28H40O8
Mol. Mass.504.6124
SMILESCCCC(=O)O[C@@H]1[C@@H](C)[C@]2(O)[C@@H]3C=C(C)C(=O)[C@@]3(O)CC(CO)=C[C@H]2[C@@H]2C(C)(C)[C@]12OC(=O)CCC